BDBM50126454 (6R,12aR)-2-((R)-1-Benzyl-pyrrolidin-3-yl)-6-(3,4-dimethoxy-phenyl)-2,3,6,7,12,12a-hexahydro-pyrazino[1',2':1,6]pyrido[3,4-b]indole-1,4-dione::CHEMBL284745
SMILES COc1ccc(cc1OC)[C@H]1N2[C@H](Cc3c1[nH]c1ccccc31)C(=O)N(CC2=O)[C@@H]1CCN(Cc2ccccc2)C1
InChI Key InChIKey=HNZPKXUYPCLKGI-YYKZIPJASA-N
Data  3 IC50
  Tab Delimited (TSV)   2D SDfile   Computed 3D by Vconf -m prep SDfile
Find this compound or compounds like it in BindingDB:
Activity Spreadsheet -- Enzyme Inhibition Constant Data from BindingDB
Found 2 hits for monomerid = 50126454
TargetcGMP-specific 3',5'-cyclic phosphodiesterase(Homo sapiens (Human))
Pfizer
Curated by ChEMBL
LigandPNGBDBM50126454((6R,12aR)-2-((R)-1-Benzyl-pyrrolidin-3-yl)-6-(3,4-...)
Affinity DataIC50: >1.00E+3nM. Assay description: Inhibitory activity against phosphodiesterase 5 (PDE5) obtained from human corpus cavernosum tissue
In DepthDetails ArticlePubMed
TargetcGMP-specific 3',5'-cyclic phosphodiesterase(Bos taurus)
University Of Lille
Curated by ChEMBL
LigandPNGBDBM50126454((6R,12aR)-2-((R)-1-Benzyl-pyrrolidin-3-yl)-6-(3,4-...)
Affinity DataIC50:  5.20E+3nM. Assay description: Inhibition of bovine PDE5 after 24 hrs by time-resolved fluorescence resonance energy transfer assay
In DepthDetails ArticlePubMed